Reaction Details
TargetFatty-acid amide hydrolase 1
LigandBDBM50426692
Substrate/Competitorn/a
Meas. Tech.ChEMBL_939830 (CHEMBL2329423)
Ki 263±n/a nM
Citation Butini, SGemma, SBrindisi, MMaramai, SMinetti, PCelona, DNapolitano, RBorsini, FCabri, WFezza, FMerlini, LDallavalle, SCampiani, GMaccarrone, M Identification of a novel arylpiperazine scaffold for fatty acid amide hydrolase inhibition with improved drug disposition properties. Bioorg Med Chem Lett23:492-5 (2012) 
 
Fatty-acid amide hydrolase 1
Name:Fatty-acid amide hydrolase 1
Type:Hydrolase; single-pass membrane protein; homodimer
Mol. Mass.:63227.28
Organism:Mus musculus (mouse)
Description:Mouse brain membranes were used in the assay.
Residue:579
BDBM50426692
NameBDBM50426692
Synonyms:CHEMBL2326495
TypeSmall organic molecule
Emp. Form.C27H34N4O
Mol. Mass.430.5851
SMILESO=C(NCCCCCCc1ccccc1)N1CCN(CC1)c1cccc(c1)-n1cccc1