Reaction Details
TargetCarbonic anhydrase 12
LigandBDBM50426706
Substrate/Competitorn/a
Meas. Tech.ChEMBL_939842 (CHEMBL2329435)
Ki 3160±n/a nM
Citation Tars, KVullo, DKazaks, ALeitans, JLends, AGrandane, AZalubovskis, RScozzafava, ASupuran, CT Sulfocoumarins (1,2-benzoxathiine-2,2-dioxides): a class of potent and isoform-selective inhibitors of tumor-associated carbonic anhydrases. J Med Chem56:293-300 (2013) 
 
Carbonic anhydrase 12
Name:Carbonic anhydrase 12
Type:Enzyme
Mol. Mass.:39456.00
Organism:Homo sapiens (Human)
Description:Catalytic domain of human cloned isozyme was used in the assay
Residue:354
BDBM50426706
NameBDBM50426706
Synonyms:CHEMBL2321923
TypeSmall organic molecule
Emp. Form.C8H5NO5S
Mol. Mass.227.194
SMILES[O-][N+](=O)c1ccc2OS(=O)(=O)C=Cc2c1