Reaction Details
TargetCarbonic anhydrase 9
LigandBDBM50426700
Substrate/Competitorn/a
Meas. Tech.ChEMBL_939843 (CHEMBL2329436)
Ki 60±n/a nM
Citation Tars, KVullo, DKazaks, ALeitans, JLends, AGrandane, AZalubovskis, RScozzafava, ASupuran, CT Sulfocoumarins (1,2-benzoxathiine-2,2-dioxides): a class of potent and isoform-selective inhibitors of tumor-associated carbonic anhydrases. J Med Chem56:293-300 (2013) 
 
Carbonic anhydrase 9
Name:Carbonic anhydrase 9
Type:Enzyme
Mol. Mass.:49669.03
Organism:Homo sapiens (Human)
Description:Catalytic domain of human cloned isozyme was used in the assay
Residue:459
BDBM50426700
NameBDBM50426700
Synonyms:CHEMBL2326516
TypeSmall organic molecule
Emp. Form.C13H15N3O3SSi
Mol. Mass.321.427
SMILESC[Si](C)(C)c1cn(nn1)-c1ccc2OS(=O)(=O)C=Cc2c1