Reaction Details
TargetCarbonic anhydrase 2
LigandBDBM50426696
Substrate/Competitorn/a
Meas. Tech.ChEMBL_939844 (CHEMBL2329437)
Ki 9350±n/a nM
Citation Tars, KVullo, DKazaks, ALeitans, JLends, AGrandane, AZalubovskis, RScozzafava, ASupuran, CT Sulfocoumarins (1,2-benzoxathiine-2,2-dioxides): a class of potent and isoform-selective inhibitors of tumor-associated carbonic anhydrases. J Med Chem56:293-300 (2013) 
 
Carbonic anhydrase 2
Name:Carbonic anhydrase 2
Type:Enzyme
Mol. Mass.:29250.71
Organism:Homo sapiens (Human)
Description:P00918
Residue:260
BDBM50426696
NameBDBM50426696
Synonyms:CHEMBL2326520
TypeSmall organic molecule
Emp. Form.C17H13N3O4S
Mol. Mass.355.368
SMILESCOc1ccc(cc1)-c1cn(nn1)-c1ccc2OS(=O)(=O)C=Cc2c1