Reaction Details
TargetCarbonic anhydrase 1
LigandBDBM50426697
Substrate/Competitorn/a
Meas. Tech.ChEMBL_939845 (CHEMBL2329438)
Ki 8430±n/a nM
Citation Tars, KVullo, DKazaks, ALeitans, JLends, AGrandane, AZalubovskis, RScozzafava, ASupuran, CT Sulfocoumarins (1,2-benzoxathiine-2,2-dioxides): a class of potent and isoform-selective inhibitors of tumor-associated carbonic anhydrases. J Med Chem56:293-300 (2013) 
 
Carbonic anhydrase 1
Name:Carbonic anhydrase 1
Type:Enzyme
Mol. Mass.:28873.37
Organism:Homo sapiens (Human)
Description:P00915
Residue:261
BDBM50426697
NameBDBM50426697
Synonyms:CHEMBL2326519
TypeSmall organic molecule
Emp. Form.C17H10F3N3O4S
Mol. Mass.409.339
SMILESFC(F)(F)Oc1ccc(cc1)-c1cn(nn1)-c1ccc2OS(=O)(=O)C=Cc2c1