Reaction Details
TargetCarbonic anhydrase 1
LigandBDBM50426698
Substrate/Competitorn/a
Meas. Tech.ChEMBL_939845 (CHEMBL2329438)
Ki 8110±n/a nM
Citation Tars, KVullo, DKazaks, ALeitans, JLends, AGrandane, AZalubovskis, RScozzafava, ASupuran, CT Sulfocoumarins (1,2-benzoxathiine-2,2-dioxides): a class of potent and isoform-selective inhibitors of tumor-associated carbonic anhydrases. J Med Chem56:293-300 (2013) 
 
Carbonic anhydrase 1
Name:Carbonic anhydrase 1
Type:Enzyme
Mol. Mass.:28873.37
Organism:Homo sapiens (Human)
Description:P00915
Residue:261
BDBM50426698
NameBDBM50426698
Synonyms:CHEMBL2326518
TypeSmall organic molecule
Emp. Form.C15H18N4O3S
Mol. Mass.334.393
SMILESCCN(CC)Cc1cn(nn1)-c1ccc2OS(=O)(=O)C=Cc2c1