Reaction Details
TargetAdenosine receptor A2a
LigandBDBM50426713
Substrate/Competitorn/a
Meas. Tech.ChEMBL_940170 (CHEMBL2328345)
Ki 12±n/a nM
Citation El-Tayeb, AGollos, S Synthesis and structure-activity relationships of 2-hydrazinyladenosine derivatives as A(2A) adenosine receptor ligands. Bioorg Med Chem21:436-47 (2012) 
 
Adenosine receptor A2a
Name:Adenosine receptor A2a
Type:G Protein-Coupled Receptor (GPCR)
Mol. Mass.:45015.65
Organism:Rattus norvegicus (rat)
Description:Rat A2A receptors expressed in CHO cells.
Residue:410
BDBM50426713
NameBDBM50426713
Synonyms:CHEMBL2326828
TypeSmall organic molecule
Emp. Form.C18H21N7O5
Mol. Mass.415.4032
SMILESCOc1ccc(CN=Nc2nc(N)c3ncn([C@@H]4O[C@H](CO)[C@@H](O)[C@H]4O)c3n2)cc1