Reaction Details
TargetProtein kinase C alpha type
LigandBDBM50393756
Substrate/Competitorn/a
Meas. Tech.ChEMBL_940569 (CHEMBL2327343)
IC50 1300±n/a nM
Citation Van Epps, SFiamengo, BEdmunds, JEricsson, AFrank, KFriedman, MGeorge, DGeorge, JGoedken, EKotecki, BMartinez, GMerta, PMorytko, MShekhar, SSkinner, BStewart, KVoss, JWallace, GWang, LWang, LWishart, N Design and synthesis of tricyclic cores for kinase inhibition. Bioorg Med Chem Lett23:693-8 (2013) 
 
Protein kinase C alpha type
Name:Protein kinase C alpha type
Type:Enzyme
Mol. Mass.:76755.65
Organism:Homo sapiens (Human)
Description:The recombinant human PKC enzymes were produced using a baculovirus expression system in SF9 cells
Residue:672
BDBM50393756
NameBDBM50393756
Synonyms:CHEMBL2159198
TypeSmall organic molecule
Emp. Form.C15H18N4
Mol. Mass.254.3302
SMILESCc1nc2cnc3[nH]ccc3c2n1C1CCCCC1