Reaction Details
TargetTyrosine-protein kinase JAK2
LigandBDBM50426736
Substrate/Competitorn/a
Meas. Tech.ChEMBL_940563 (CHEMBL2327181)
IC50 11400±n/a nM
Citation Van Epps, SFiamengo, BEdmunds, JEricsson, AFrank, KFriedman, MGeorge, DGeorge, JGoedken, EKotecki, BMartinez, GMerta, PMorytko, MShekhar, SSkinner, BStewart, KVoss, JWallace, GWang, LWang, LWishart, N Design and synthesis of tricyclic cores for kinase inhibition. Bioorg Med Chem Lett23:693-8 (2013) 
 
Tyrosine-protein kinase JAK2
Name:Tyrosine-protein kinase JAK2
Type:Protein
Mol. Mass.:130684.68
Organism:Homo sapiens (Human)
Description:O60674
Residue:1132
BDBM50426736
NameBDBM50426736
Synonyms:CHEMBL2322139
TypeSmall organic molecule
Emp. Form.C15H15F3N4
Mol. Mass.308.3016
SMILESFC(F)(F)c1nc2cnc3[nH]ccc3c2n1C1CCCCC1