Reaction Details
TargetTyrosine-protein kinase JAK2
LigandBDBM50426737
Substrate/Competitorn/a
Meas. Tech.ChEMBL_940571 (CHEMBL2327345)
IC50 30±n/a nM
Citation Van Epps, SFiamengo, BEdmunds, JEricsson, AFrank, KFriedman, MGeorge, DGeorge, JGoedken, EKotecki, BMartinez, GMerta, PMorytko, MShekhar, SSkinner, BStewart, KVoss, JWallace, GWang, LWang, LWishart, N Design and synthesis of tricyclic cores for kinase inhibition. Bioorg Med Chem Lett23:693-8 (2013) 
 
Tyrosine-protein kinase JAK2
Name:Tyrosine-protein kinase JAK2
Type:Protein
Mol. Mass.:130684.68
Organism:Homo sapiens (Human)
Description:O60674
Residue:1132
BDBM50426737
NameBDBM50426737
Synonyms:CHEMBL2322137
TypeSmall organic molecule
Emp. Form.C14H15N3O
Mol. Mass.241.2884
SMILESC1CCC(CC1)c1noc2cnc3[nH]ccc3c12