Reaction Details
TargetTyrosine-protein kinase JAK1
LigandBDBM50426735
Substrate/Competitorn/a
Meas. Tech.ChEMBL_940566 (CHEMBL2327340)
EC50 350±n/a nM
Citation Van Epps, SFiamengo, BEdmunds, JEricsson, AFrank, KFriedman, MGeorge, DGeorge, JGoedken, EKotecki, BMartinez, GMerta, PMorytko, MShekhar, SSkinner, BStewart, KVoss, JWallace, GWang, LWang, LWishart, N Design and synthesis of tricyclic cores for kinase inhibition. Bioorg Med Chem Lett23:693-8 (2013) 
 
Tyrosine-protein kinase JAK1
Name:Tyrosine-protein kinase JAK1
Type:Protein
Mol. Mass.:133293.73
Organism:Homo sapiens (Human)
Description:P23458
Residue:1154
BDBM50426735
NameBDBM50426735
Synonyms:CHEMBL2322141
TypeSmall organic molecule
Emp. Form.C13H15N5
Mol. Mass.241.2917
SMILESC1CCC(CC1)c1nnc2cnc3[nH]ccc3n12