Reaction Details
TargetVascular endothelial growth factor receptor 2
LigandBDBM50426737
Substrate/Competitorn/a
Meas. Tech.ChEMBL_940570 (CHEMBL2327344)
IC50 200±n/a nM
Citation Van Epps, SFiamengo, BEdmunds, JEricsson, AFrank, KFriedman, MGeorge, DGeorge, JGoedken, EKotecki, BMartinez, GMerta, PMorytko, MShekhar, SSkinner, BStewart, KVoss, JWallace, GWang, LWang, LWishart, N Design and synthesis of tricyclic cores for kinase inhibition. Bioorg Med Chem Lett23:693-8 (2013) 
 
Vascular endothelial growth factor receptor 2
Name:Vascular endothelial growth factor receptor 2
Type:Receptor Tyrosine Kinase
Mol. Mass.:151510.97
Organism:Homo sapiens (Human)
Description:P35968
Residue:1356
BDBM50426737
NameBDBM50426737
Synonyms:CHEMBL2322137
TypeSmall organic molecule
Emp. Form.C14H15N3O
Mol. Mass.241.2884
SMILESC1CCC(CC1)c1noc2cnc3[nH]ccc3c12