Reaction Details
TargetVascular endothelial growth factor receptor 2
LigandBDBM50426738
Substrate/Competitorn/a
Meas. Tech.ChEMBL_940570 (CHEMBL2327344)
IC50 160±n/a nM
Citation Van Epps, SFiamengo, BEdmunds, JEricsson, AFrank, KFriedman, MGeorge, DGeorge, JGoedken, EKotecki, BMartinez, GMerta, PMorytko, MShekhar, SSkinner, BStewart, KVoss, JWallace, GWang, LWang, LWishart, N Design and synthesis of tricyclic cores for kinase inhibition. Bioorg Med Chem Lett23:693-8 (2013) 
 
Vascular endothelial growth factor receptor 2
Name:Vascular endothelial growth factor receptor 2
Type:Receptor Tyrosine Kinase
Mol. Mass.:151510.97
Organism:Homo sapiens (Human)
Description:P35968
Residue:1356
BDBM50426738
NameBDBM50426738
Synonyms:CHEMBL2322136
TypeSmall organic molecule
Emp. Form.C15H18N4
Mol. Mass.254.3302
SMILESCn1nc(C2CCCCC2)c2c3cc[nH]c3ncc12