Reaction Details
TargetReceptor-type tyrosine-protein kinase FLT3
LigandBDBM50426740
Substrate/Competitorn/a
Meas. Tech.ChEMBL_940572 (CHEMBL2327346)
IC50>50000±n/a nM
Citation Van Epps, SFiamengo, BEdmunds, JEricsson, AFrank, KFriedman, MGeorge, DGeorge, JGoedken, EKotecki, BMartinez, GMerta, PMorytko, MShekhar, SSkinner, BStewart, KVoss, JWallace, GWang, LWang, LWishart, N Design and synthesis of tricyclic cores for kinase inhibition. Bioorg Med Chem Lett23:693-8 (2013) 
 
Receptor-type tyrosine-protein kinase FLT3
Name:Receptor-type tyrosine-protein kinase FLT3
Type:Enzyme
Mol. Mass.:112888.62
Organism:Homo sapiens (Human)
Description:P36888
Residue:993
BDBM50426740
NameBDBM50426740
Synonyms:CHEMBL2322140
TypeSmall organic molecule
Emp. Form.C16H21N3
Mol. Mass.255.358
SMILESC1CCC(CC1)N1CCCc2cnc3[nH]ccc3c12