Reaction Details
TargetReceptor-type tyrosine-protein kinase FLT3
LigandBDBM50426738
Substrate/Competitorn/a
Meas. Tech.ChEMBL_940572 (CHEMBL2327346)
IC50 440±n/a nM
Citation Van Epps, SFiamengo, BEdmunds, JEricsson, AFrank, KFriedman, MGeorge, DGeorge, JGoedken, EKotecki, BMartinez, GMerta, PMorytko, MShekhar, SSkinner, BStewart, KVoss, JWallace, GWang, LWang, LWishart, N Design and synthesis of tricyclic cores for kinase inhibition. Bioorg Med Chem Lett23:693-8 (2013) 
 
Receptor-type tyrosine-protein kinase FLT3
Name:Receptor-type tyrosine-protein kinase FLT3
Type:Enzyme
Mol. Mass.:112888.62
Organism:Homo sapiens (Human)
Description:P36888
Residue:993
BDBM50426738
NameBDBM50426738
Synonyms:CHEMBL2322136
TypeSmall organic molecule
Emp. Form.C15H18N4
Mol. Mass.254.3302
SMILESCn1nc(C2CCCCC2)c2c3cc[nH]c3ncc12