Reaction Details
TargetAurora kinase A
LigandBDBM50426733
Substrate/Competitorn/a
Meas. Tech.ChEMBL_940573 (CHEMBL2327347)
IC50 30±n/a nM
Citation Van Epps, SFiamengo, BEdmunds, JEricsson, AFrank, KFriedman, MGeorge, DGeorge, JGoedken, EKotecki, BMartinez, GMerta, PMorytko, MShekhar, SSkinner, BStewart, KVoss, JWallace, GWang, LWang, LWishart, N Design and synthesis of tricyclic cores for kinase inhibition. Bioorg Med Chem Lett23:693-8 (2013) 
 
Aurora kinase A
Name:Aurora kinase A
Type:Serine/threonine-protein kinase
Mol. Mass.:45830.98
Organism:Homo sapiens (Human)
Description:O14965
Residue:403
BDBM50426733
NameBDBM50426733
Synonyms:CHEMBL2322143
TypeSmall organic molecule
Emp. Form.C15H17N3
Mol. Mass.239.3156
SMILESC1CCC(CC1)c1ccc2cnc3[nH]ccc3n12