Reaction Details
TargetAurora kinase A
LigandBDBM50393756
Substrate/Competitorn/a
Meas. Tech.ChEMBL_940573 (CHEMBL2327347)
IC50 640±n/a nM
Citation Van Epps, SFiamengo, BEdmunds, JEricsson, AFrank, KFriedman, MGeorge, DGeorge, JGoedken, EKotecki, BMartinez, GMerta, PMorytko, MShekhar, SSkinner, BStewart, KVoss, JWallace, GWang, LWang, LWishart, N Design and synthesis of tricyclic cores for kinase inhibition. Bioorg Med Chem Lett23:693-8 (2013) 
 
Aurora kinase A
Name:Aurora kinase A
Type:Serine/threonine-protein kinase
Mol. Mass.:45830.98
Organism:Homo sapiens (Human)
Description:O14965
Residue:403
BDBM50393756
NameBDBM50393756
Synonyms:CHEMBL2159198
TypeSmall organic molecule
Emp. Form.C15H18N4
Mol. Mass.254.3302
SMILESCc1nc2cnc3[nH]ccc3c2n1C1CCCCC1