Reaction Details
TargetNon-receptor tyrosine-protein kinase TYK2
LigandBDBM50426739
Substrate/Competitorn/a
Meas. Tech.ChEMBL_940568 (CHEMBL2327342)
IC50 50±n/a nM
Citation Van Epps, SFiamengo, BEdmunds, JEricsson, AFrank, KFriedman, MGeorge, DGeorge, JGoedken, EKotecki, BMartinez, GMerta, PMorytko, MShekhar, SSkinner, BStewart, KVoss, JWallace, GWang, LWang, LWishart, N Design and synthesis of tricyclic cores for kinase inhibition. Bioorg Med Chem Lett23:693-8 (2013) 
 
Non-receptor tyrosine-protein kinase TYK2
Name:Non-receptor tyrosine-protein kinase TYK2
Type:Protein
Mol. Mass.:133666.03
Organism:Homo sapiens (Human)
Description:P29597
Residue:1187
BDBM50426739
NameBDBM50426739
Synonyms:CHEMBL2322135
TypeSmall organic molecule
Emp. Form.C14H16N4
Mol. Mass.240.3036
SMILESC1CCC(CC1)c1n[nH]c2cnc3[nH]ccc3c12