Reaction Details
TargetXanthine dehydrogenase/oxidase
LigandBDBM50320491
Substrate/Competitorn/a
Meas. Tech.ChEMBL_940601 (CHEMBL2327375)
IC50 20±n/a nM
Citation Bajaj, KBurudkar, SShah, PKeche, AGhosh, UTannu, PKhanna, SSrivastava, ADeshmukh, NJDixit, AAhire, YDamre, ANemmani, KVKulkarni-Almeida, AB-Rao, CSharma, RSivaramakrishnan, H Lead optimization of isocytosine-derived xanthine oxidase inhibitors. Bioorg Med Chem Lett23:834-8 (2013) 
 
Xanthine dehydrogenase/oxidase
Name:Xanthine dehydrogenase/oxidase
Type:Protein
Mol. Mass.:146809.00
Organism:Bos taurus (Bovine)
Description:P80457
Residue:1332
BDBM50320491
NameBDBM50320491
Synonyms:2-(3-CYANO-4-ISOBUTOXY-PHENYL)-4-METHYL-5-THIAZOLE-CARBOXYLIC ACID FEBUXOSTAT | US11744839, Compound of formula 5
TypeSmall organic molecule
Emp. Form.C16H16N2O3S
Mol. Mass.316.375
SMILESCC(C)COc1ccc(cc1C#N)-c1nc(C)c(s1)C(O)=O