Reaction Details
TargetType-1 angiotensin II receptor
LigandBDBM50426773
Substrate/Competitorn/a
Meas. Tech.ChEMBL_940612 (CHEMBL2327554)
IC50 24±n/a nM
Citation Casimiro-Garcia, AHeemstra, RJBigge, CFChen, JCiske, FADavis, JAEllis, TEsmaeil, NFlynn, DHan, SJalaie, MOhren, JFPowell, NA Design, synthesis, and evaluation of imidazo[4,5-c]pyridin-4-one derivatives with dual activity at angiotensin II type 1 receptor and peroxisome proliferator-activated receptor-¿. Bioorg Med Chem Lett23:767-72 (2013) 
 
Type-1 angiotensin II receptor
Name:Type-1 angiotensin II receptor
Type:Protein
Mol. Mass.:41080.75
Organism:Homo sapiens (Human)
Description:P30556
Residue:359
BDBM50426773
NameBDBM50426773
Synonyms:CHEMBL2322438
TypeSmall organic molecule
Emp. Form.C28H28N8O2
Mol. Mass.508.5743
SMILESCCc1nc2ccn(CC(=O)N(C)C)c(=O)c2n1[C@H]1CCc2cc(ccc12)-c1ccccc1-c1nnn[nH]1