Reaction Details
TargetCarbonic anhydrase 12
LigandBDBM50426822
Substrate/Competitorn/a
Meas. Tech.ChEMBL_938159 (CHEMBL2328241)
Ki 14600±n/a nM
Citation Bozdag, MDreker, THenry, CTosco, PVallaro, MFruttero, RScozzafava, ACarta, FSupuran, CT Novel small molecule protein arginine deiminase 4 (PAD4) inhibitors. Bioorg Med Chem Lett23:715-9 (2013) 
 
Carbonic anhydrase 12
Name:Carbonic anhydrase 12
Type:Enzyme
Mol. Mass.:39456.00
Organism:Homo sapiens (Human)
Description:Catalytic domain of human cloned isozyme was used in the assay
Residue:354
BDBM50426822
NameBDBM50426822
Synonyms:1-(4-Hydroxyphenyl)Guanidine Hydrochloride | CHEMBL2323124
TypeSmall organic molecule
Emp. Form.C7H9N3O
Mol. Mass.151.1659
SMILES[#7]\[#6](-[#7])=[#7]\c1ccc(-[#8])cc1