Reaction Details
TargetCarbonic anhydrase 1
LigandBDBM26187
Substrate/Competitorn/a
Meas. Tech.ChEMBL_938161 (CHEMBL2328243)
Ki 10200±n/a nM
Citation Bozdag, MDreker, THenry, CTosco, PVallaro, MFruttero, RScozzafava, ACarta, FSupuran, CT Novel small molecule protein arginine deiminase 4 (PAD4) inhibitors. Bioorg Med Chem Lett23:715-9 (2013) 
 
Carbonic anhydrase 1
Name:Carbonic anhydrase 1
Type:Enzyme
Mol. Mass.:28873.37
Organism:Homo sapiens (Human)
Description:P00915
Residue:261
BDBM26187
NameBDBM26187
Synonyms:α-CA inhibitor, 11 US9688816, 2 | phenol
TypeSmall organic molecule
Emp. Form.C6H6O
Mol. Mass.94.1112
SMILESOc1ccccc1