Reaction Details
TargetCarbonic anhydrase 1
LigandBDBM50426821
Substrate/Competitorn/a
Meas. Tech.ChEMBL_938161 (CHEMBL2328243)
Ki 240±n/a nM
Citation Bozdag, MDreker, THenry, CTosco, PVallaro, MFruttero, RScozzafava, ACarta, FSupuran, CT Novel small molecule protein arginine deiminase 4 (PAD4) inhibitors. Bioorg Med Chem Lett23:715-9 (2013) 
 
Carbonic anhydrase 1
Name:Carbonic anhydrase 1
Type:Enzyme
Mol. Mass.:28873.37
Organism:Homo sapiens (Human)
Description:P00915
Residue:261
BDBM50426821
NameBDBM50426821
Synonyms:4-(2-Guanidinoethyl)Benzenesulfonamide Hydrochloride | CHEMBL2323125
TypeSmall organic molecule
Emp. Form.C9H14N4O2S
Mol. Mass.242.298
SMILES[#7]\[#6](-[#7])=[#7]/[#6]-[#6]-c1ccc(cc1)S([#7])(=O)=O