Reaction Details
TargetThymidylate synthase
LigandBDBM50426854
Substrate/Competitorn/a
Meas. Tech.ChEMBL_938342 (CHEMBL2329016)
Ki 1900±n/a nM
Citation Ferrari, SIngrami, MSoragni, FWade, RCCosti, MP Ligand-based discovery of N-(1,3-dioxo-1H,3H-benzo[de]isochromen-5-yl)-carboxamide and sulfonamide derivatives as thymidylate synthase A inhibitors. Bioorg Med Chem Lett23:663-8 (2013) 
 
Thymidylate synthase
Name:Thymidylate synthase
Type:Enzyme
Mol. Mass.:30475.81
Organism:Escherichia coli
Description:n/a
Residue:264
BDBM50426854
NameBDBM50426854
Synonyms:CHEMBL2323362
TypeSmall organic molecule
Emp. Form.C22H13F3N2O5S2
Mol. Mass.506.474
SMILESCn1cc(cc1C(F)(F)F)-c1ccc(s1)S(=O)(=O)Nc1cc2C(=O)OC(=O)c3cccc(c1)c23