Reaction Details
TargetThymidylate synthase
LigandBDBM50426855
Substrate/Competitorn/a
Meas. Tech.ChEMBL_938342 (CHEMBL2329016)
Ki 300±n/a nM
Citation Ferrari, SIngrami, MSoragni, FWade, RCCosti, MP Ligand-based discovery of N-(1,3-dioxo-1H,3H-benzo[de]isochromen-5-yl)-carboxamide and sulfonamide derivatives as thymidylate synthase A inhibitors. Bioorg Med Chem Lett23:663-8 (2013) 
 
Thymidylate synthase
Name:Thymidylate synthase
Type:Enzyme
Mol. Mass.:30475.81
Organism:Escherichia coli
Description:n/a
Residue:264
BDBM50426855
NameBDBM50426855
Synonyms:CHEMBL2323403
TypeSmall organic molecule
Emp. Form.C20H13NO5S
Mol. Mass.379.386
SMILESO=C1OC(=O)c2cc(NS(=O)(=O)\C=C\c3ccccc3)cc3cccc1c23