Reaction Details
TargetThymidylate synthase
LigandBDBM50426858
Substrate/Competitorn/a
Meas. Tech.ChEMBL_938342 (CHEMBL2329016)
Ki 900±n/a nM
Citation Ferrari, SIngrami, MSoragni, FWade, RCCosti, MP Ligand-based discovery of N-(1,3-dioxo-1H,3H-benzo[de]isochromen-5-yl)-carboxamide and sulfonamide derivatives as thymidylate synthase A inhibitors. Bioorg Med Chem Lett23:663-8 (2013) 
 
Thymidylate synthase
Name:Thymidylate synthase
Type:Enzyme
Mol. Mass.:30475.81
Organism:Escherichia coli
Description:n/a
Residue:264
BDBM50426858
NameBDBM50426858
Synonyms:CHEMBL2323397
TypeSmall organic molecule
Emp. Form.C18H9N3O5S2
Mol. Mass.411.411
SMILESO=C1OC(=O)c2cc(NS(=O)(=O)c3cccc4nsnc34)cc3cccc1c23