Reaction Details
TargetSerine/threonine-protein kinase PLK1
LigandBDBM2579
Substrate/Competitorn/a
Meas. Tech.ChEMBL_938500 (CHEMBL2327184)
IC50 129000±n/a nM
Citation Mita, YNoguchi-Yachide, TIshikawa, MHashimoto, Y Small-molecular, non-peptide, non-ATP-competitive polo-like kinase 1 (Plk1) inhibitors with a terphenyl skeleton. Bioorg Med Chem21:608-17 (2013) 
 
Serine/threonine-protein kinase PLK1
Name:Serine/threonine-protein kinase PLK1
Type:Serine/threonine-protein kinase
Mol. Mass.:68277.16
Organism:Homo sapiens (Human)
Description:P53350
Residue:603
BDBM2579
NameBDBM2579
Synonyms:(2S,3R,4R,6R)-3-methoxy-2-methyl-4-(methylamino)-29-oxa-1,7,17-triazaoctacyclo[12.12.2.1^{2,6}.0^{7,28}.0^{8,13}.0^{15,19}.0^{20,27}.0^{21,26}]nonacosa-8(13),9,11,14(28),15(19),20(27),21(26),22,24-nonaen-16-one Staurosporin, 4 Staurosporine, 8 US9206188, Staurosporine | US9226923, Staurosporine
TypeSmall organic molecule
Emp. Form.C28H26N4O3
Mol. Mass.466.531
SMILESCN[C@@H]1C[C@H]2O[C@@](C)([C@@H]1OC)n1c3ccccc3c3c4CNC(=O)c4c4c5ccccc5n2c4c13