Reaction Details
TargetFarnesyl diphosphate synthase
LigandBDBM12576
Substrate/Competitorn/a
Meas. Tech.ChEMBL_939177 (CHEMBL2329369)
IC50 27±n/a nM
Citation Recher, MBarboza, APLi, ZHGalizzi, MFerrer-Casal, MSzajnman, SHDocampo, RMoreno, SNRodriguez, JB Design, synthesis and biological evaluation of sulfur-containing 1,1-bisphosphonic acids as antiparasitic agents. Eur J Med Chem60:431-40 (2013) 
 
Farnesyl diphosphate synthase
Name:Farnesyl diphosphate synthase
Synonyms:n/a
Type:PROTEIN
Mol. Mass.:48827.21
Organism:Trypanosoma cruzi
Description:ChEMBL_939177
Residue:425
BDBM12576
NameBDBM12576
TypeSmall organic molecule
Emp. Form.C7H11NO7P2
Mol. Mass.283.1123
SMILESOC(Cc1cccnc1)(P(O)(O)=O)P(O)(O)=O