Reaction Details
TargetRenin
LigandBDBM50427040
Substrate/Competitorn/a
Meas. Tech.ChEMBL_939881 (CHEMBL2327103)
IC50 25±n/a nM
Citation Ostermann, NRuedisser, SEhrhardt, CBreitenstein, WMarzinzik, AJacoby, EVangrevelinghe, EOttl, JKlumpp, MHartwieg, JCCumin, FHassiepen, UTrappe, JSedrani, RGeisse, SGerhartz, BRichert, PFrancotte, EWagner, TKrömer, MKosaka, TWebb, RLRigel, DFMaibaum, JBaeschlin, DK A novel class of oral direct renin inhibitors: highly potent 3,5-disubstituted piperidines bearing a tricyclic p3-p1 pharmacophore. J Med Chem56:2196-206 (2013) 
 
Renin
Name:Renin
Type:Enzyme
Mol. Mass.:45058.99
Organism:Homo sapiens (Human)
Description:n/a
Residue:406
BDBM50427040
NameBDBM50427040
Synonyms:CHEMBL2322207
TypeSmall organic molecule
Emp. Form.C32H39N3O5S
Mol. Mass.577.734
SMILESCOCCCCC1(CNC(=O)[C@@H]2CNC[C@@H](C2)NS(=O)(=O)c2ccc(C)cc2)c2ccccc2Oc2ccccc12