Reaction Details
TargetKappa-type opioid receptor
LigandBDBM50427044
Substrate/Competitorn/a
Meas. Tech.ChEMBL_939906 (CHEMBL2327128)
IC50 77±n/a nM
Citation Carroll, FICarlezon, WA Development of¿ opioid receptor antagonists. J Med Chem56:2178-95 (2013) 
 
Kappa-type opioid receptor
Name:Kappa-type opioid receptor
Type:G Protein-Coupled Receptor (GPCR)
Mol. Mass.:42648.76
Organism:Homo sapiens (Human)
Description:P41145
Residue:380
BDBM50427044
NameBDBM50427044
Synonyms:CHEMBL2322511
TypeSmall organic molecule
Emp. Form.C34H40N4O3
Mol. Mass.552.7064
SMILESO=C(Nc1cccc(NC(=O)c2cccc(c2)N2CCCCC2)c1)c1cccc(OC2CCN(CC3CC3)CC2)c1