Reaction Details
TargetMu-type opioid receptor
LigandBDBM50012153
Substrate/Competitorn/a
Meas. Tech.ChEMBL_940042 (CHEMBL2327851)
Ki 5880±n/a nM
Citation Carroll, FICarlezon, WA Development of¿ opioid receptor antagonists. J Med Chem56:2178-95 (2013) 
 
Mu-type opioid receptor
Name:Mu-type opioid receptor
Type:G Protein-Coupled Receptor (GPCR)
Mol. Mass.:44789.51
Organism:Homo sapiens (Human)
Description:P35372
Residue:400
BDBM50012153
NameBDBM50012153
Synonyms:zyklophin
TypeSmall organic molecule
Emp. Form.C65H96N20O13
Mol. Mass.1365.5839
SMILES[H][C@]1(NC(=O)[C@H](CCCNC(N)=N)NC(=O)[C@H](CC(=O)NC[C@H](NC1=O)C(=O)N[C@@H](CCCNC(N)=N)C(=O)N1CCC[C@H]1C(=O)N[C@@H](CCCCN)C(N)=O)NC(=O)[C@H](Cc1ccccc1)NC(=O)CNC(=O)CNC(=O)[C@H](Cc1ccc(O)cc1)NCc1ccccc1)[C@@H](C)CC