Reaction Details
TargetC-C chemokine receptor type 1
LigandBDBM50427079
Substrate/Competitorn/a
Meas. Tech.ChEMBL_940424 (CHEMBL2329311)
IC50 16±n/a nM
Citation Pennell, AMAggen, JBSen, SChen, WXu, YSullivan, ELi, LGreenman, KCharvat, THansen, DDairaghi, DJWright, JJZhang, P 1-(4-Phenylpiperazin-1-yl)-2-(1H-pyrazol-1-yl)ethanones as novel CCR1 antagonists. Bioorg Med Chem Lett23:1228-31 (2013) 
 
C-C chemokine receptor type 1
Name:C-C chemokine receptor type 1
Type:Enzyme
Mol. Mass.:41180.69
Organism:Homo sapiens (Human)
Description:P32246
Residue:355
BDBM50427079
NameBDBM50427079
Synonyms:CHEMBL2322845
TypeSmall organic molecule
Emp. Form.C20H26Cl2N4O3
Mol. Mass.441.351
SMILESCOc1cc(ccc1Cl)N1CCN(CC1)C(=O)Cn1nc(c(Cl)c1C)C(C)(C)O