Reaction Details
TargetC-C chemokine receptor type 1
LigandBDBM50427093
Substrate/Competitorn/a
Meas. Tech.ChEMBL_940424 (CHEMBL2329311)
IC50 7.0±n/a nM
Citation Pennell, AMAggen, JBSen, SChen, WXu, YSullivan, ELi, LGreenman, KCharvat, THansen, DDairaghi, DJWright, JJZhang, P 1-(4-Phenylpiperazin-1-yl)-2-(1H-pyrazol-1-yl)ethanones as novel CCR1 antagonists. Bioorg Med Chem Lett23:1228-31 (2013) 
 
C-C chemokine receptor type 1
Name:C-C chemokine receptor type 1
Type:Enzyme
Mol. Mass.:41180.69
Organism:Homo sapiens (Human)
Description:P32246
Residue:355
BDBM50427093
NameBDBM50427093
Synonyms:CHEMBL2322860
TypeSmall organic molecule
Emp. Form.C18H19ClF3IN4O2
Mol. Mass.542.722
SMILESCOc1cc(ccc1Cl)N1CCN(CC1)C(=O)Cn1nc(c(I)c1C)C(F)(F)F