Reaction Details
TargetC-C chemokine receptor type 1
LigandBDBM50427095
Substrate/Competitorn/a
Meas. Tech.ChEMBL_940424 (CHEMBL2329311)
IC50 5.0±n/a nM
Citation Pennell, AMAggen, JBSen, SChen, WXu, YSullivan, ELi, LGreenman, KCharvat, THansen, DDairaghi, DJWright, JJZhang, P 1-(4-Phenylpiperazin-1-yl)-2-(1H-pyrazol-1-yl)ethanones as novel CCR1 antagonists. Bioorg Med Chem Lett23:1228-31 (2013) 
 
C-C chemokine receptor type 1
Name:C-C chemokine receptor type 1
Type:Enzyme
Mol. Mass.:41180.69
Organism:Homo sapiens (Human)
Description:P32246
Residue:355
BDBM50427095
NameBDBM50427095
Synonyms:CHEMBL2322858
TypeSmall organic molecule
Emp. Form.C18H19ClF4N4O2
Mol. Mass.434.816
SMILESCOc1cc(ccc1Cl)N1CCN(CC1)C(=O)Cn1nc(c(F)c1C)C(F)(F)F