Reaction Details
TargetHepatocyte growth factor receptor
LigandBDBM50347659
Substrate/Competitorn/a
Meas. Tech.ChEMBL_940646 (CHEMBL2327588)
IC50 2.0±n/a nM
Citation Northrup, ABKatcher, MHAltman, MDChenard, MDaniels, MHDeshmukh, SVFalcone, DGuerin, DJHatch, HLi, CLu, WLutterbach, BAllison, TJPatel, SBReilly, JFReutershan, MRickert, KWRosenstein, CSoisson, SMSzewczak, AAWalker, DWilson, KYoung, JRPan, BSDinsmore, CJ Discovery of 1-[3-(1-methyl-1H-pyrazol-4-yl)-5-oxo-5H-benzo[4,5]cyclohepta[1,2-b]pyridin-7-yl]-N-(pyridin-2-ylmethyl)methanesulfonamide (MK-8033): A Specific c-Met/Ron dual kinase inhibitor with preferential affinity for the activated state of c-Met. J Med Chem56:2294-310 (2013) 
 
Hepatocyte growth factor receptor
Name:Hepatocyte growth factor receptor
Type:Protein
Mol. Mass.:155559.73
Organism:Homo sapiens (Human)
Description:P08581
Residue:1390
BDBM50347659
NameBDBM50347659
Synonyms:CHEMBL1802916 | MK-2461
TypeSmall organic molecule
Emp. Form.C24H25N5O5S
Mol. Mass.495.551
SMILESCN(C[C@@H]1COCCO1)S(=O)(=O)Nc1ccc2ccc3ncc(cc3c(=O)c2c1)-c1cnn(C)c1