Reaction Details
TargetHepatocyte growth factor receptor
LigandBDBM50427138
Substrate/Competitorn/a
Meas. Tech.ChEMBL_940625 (CHEMBL2327567)
Kd 10±n/a nM
Citation Northrup, ABKatcher, MHAltman, MDChenard, MDaniels, MHDeshmukh, SVFalcone, DGuerin, DJHatch, HLi, CLu, WLutterbach, BAllison, TJPatel, SBReilly, JFReutershan, MRickert, KWRosenstein, CSoisson, SMSzewczak, AAWalker, DWilson, KYoung, JRPan, BSDinsmore, CJ Discovery of 1-[3-(1-methyl-1H-pyrazol-4-yl)-5-oxo-5H-benzo[4,5]cyclohepta[1,2-b]pyridin-7-yl]-N-(pyridin-2-ylmethyl)methanesulfonamide (MK-8033): A Specific c-Met/Ron dual kinase inhibitor with preferential affinity for the activated state of c-Met. J Med Chem56:2294-310 (2013) 
 
Hepatocyte growth factor receptor
Name:Hepatocyte growth factor receptor
Type:Protein
Mol. Mass.:155559.73
Organism:Homo sapiens (Human)
Description:P08581
Residue:1390
BDBM50427138
NameBDBM50427138
Synonyms:CHEMBL2323775 | MK-8033
TypeSmall organic molecule
Emp. Form.C25H21N5O3S
Mol. Mass.471.531
SMILESCn1cc(cn1)-c1cnc2ccc3ccc(CS(=O)(=O)NCc4ccccn4)cc3c(=O)c2c1