Reaction Details
TargetD-amino-acid oxidase
LigandBDBM36181
Substrate/Competitorn/a
Meas. Tech.ChEMBL_938779 (CHEMBL2327788)
Ki 10900±n/a nM
Citation Katane, MOsaka, NMatsuda, SMaeda, KKawata, TSaitoh, YSekine, MFuruchi, TDoi, IHirono, SHomma, H Identification of novel D-amino acid oxidase inhibitors by in silico screening and their functional characterization in vitro. J Med Chem56:1894-907 (2013) 
 
D-amino-acid oxidase
Name:D-amino-acid oxidase
Type:Homodimer
Mol. Mass.:39476.06
Organism:Homo sapiens (Human)
Description:P14920
Residue:347
BDBM36181
NameBDBM36181
Synonyms:SODIUM BENZOATE benzoic acid | benzoic acid-d5
TypeGuest
Emp. Form.C7H5O2
Mol. Mass.121.1139
SMILES[O-]C(=O)c1ccccc1