Reaction Details
TargetD-amino-acid oxidase
LigandBDBM50074328
Substrate/Competitorn/a
Meas. Tech.ChEMBL_938779 (CHEMBL2327788)
Ki 8160±n/a nM
Citation Katane, MOsaka, NMatsuda, SMaeda, KKawata, TSaitoh, YSekine, MFuruchi, TDoi, IHirono, SHomma, H Identification of novel D-amino acid oxidase inhibitors by in silico screening and their functional characterization in vitro. J Med Chem56:1894-907 (2013) 
 
D-amino-acid oxidase
Name:D-amino-acid oxidase
Type:Homodimer
Mol. Mass.:39476.06
Organism:Homo sapiens (Human)
Description:P14920
Residue:347
BDBM50074328
NameBDBM50074328
Synonyms:CHEMBL164585 | Thiophene-3-carboxylic acid
TypeSmall organic molecule
Emp. Form.C5H4O2S
Mol. Mass.128.149
SMILESOC(=O)c1ccsc1