Reaction Details
TargetSerine racemase
LigandBDBM31147
Substrate/Competitorn/a
Meas. Tech.ChEMBL_938786 (CHEMBL2327930)
IC50>100000±n/a nM
Citation Katane, MOsaka, NMatsuda, SMaeda, KKawata, TSaitoh, YSekine, MFuruchi, TDoi, IHirono, SHomma, H Identification of novel D-amino acid oxidase inhibitors by in silico screening and their functional characterization in vitro. J Med Chem56:1894-907 (2013) 
 
Serine racemase
Name:Serine racemase
Type:PROTEIN
Mol. Mass.:36565.80
Organism:Homo sapiens (Human)
Description:ChEMBL_1516972
Residue:340
BDBM31147
NameBDBM31147
Synonyms:4H-furo[3,2-b]pyrrole-5-carboxylic acid CHEMBL492591
TypeSmall organic molecule
Emp. Form.C7H5NO3
Mol. Mass.151.1195
SMILESOC(=O)c1cc2occc2[nH]1