Reaction Details
TargetReceptor tyrosine-protein kinase erbB-3
LigandBDBM50427227
Substrate/Competitorn/a
Meas. Tech.ChEMBL_938526 (CHEMBL2327210)
IC50 40200±n/a nM
Citation Yang, WHu, YYang, YSZhang, FZhang, YBWang, XLTang, JFZhong, WQZhu, HL Design, modification and 3D QSAR studies of novel naphthalin-containing pyrazoline derivatives with/without thiourea skeleton as anticancer agents. Bioorg Med Chem21:1050-63 (2013) 
 
Receptor tyrosine-protein kinase erbB-3
Name:Receptor tyrosine-protein kinase erbB-3
Type:PROTEIN
Mol. Mass.:148097.73
Organism:Homo sapiens (Human)
Description:ChEMBL_774331
Residue:1342
BDBM50427227
NameBDBM50427227
Synonyms:CHEMBL2325092
TypeSmall organic molecule
Emp. Form.C26H22N2O
Mol. Mass.378.4657
SMILESCOc1ccc(cc1)C1=NN(C(C1)c1cccc2ccccc12)c1ccccc1