Reaction Details
TargetReceptor tyrosine-protein kinase erbB-3
LigandBDBM50427230
Substrate/Competitorn/a
Meas. Tech.ChEMBL_938526 (CHEMBL2327210)
IC50 55600±n/a nM
Citation Yang, WHu, YYang, YSZhang, FZhang, YBWang, XLTang, JFZhong, WQZhu, HL Design, modification and 3D QSAR studies of novel naphthalin-containing pyrazoline derivatives with/without thiourea skeleton as anticancer agents. Bioorg Med Chem21:1050-63 (2013) 
 
Receptor tyrosine-protein kinase erbB-3
Name:Receptor tyrosine-protein kinase erbB-3
Type:PROTEIN
Mol. Mass.:148097.73
Organism:Homo sapiens (Human)
Description:ChEMBL_774331
Residue:1342
BDBM50427230
NameBDBM50427230
Synonyms:CHEMBL2325106
TypeSmall organic molecule
Emp. Form.C21H19N3OS
Mol. Mass.361.46
SMILESCOc1ccc(cc1)C1=NN(C(C1)c1cccc2ccccc12)C(N)=S