Reaction Details
TargetFocal adhesion kinase 1
LigandBDBM50427225
Substrate/Competitorn/a
Meas. Tech.ChEMBL_938525 (CHEMBL2327209)
IC50 6200±n/a nM
Citation Yang, WHu, YYang, YSZhang, FZhang, YBWang, XLTang, JFZhong, WQZhu, HL Design, modification and 3D QSAR studies of novel naphthalin-containing pyrazoline derivatives with/without thiourea skeleton as anticancer agents. Bioorg Med Chem21:1050-63 (2013) 
 
Focal adhesion kinase 1
Name:Focal adhesion kinase 1
Type:Tyrosine-protein kinase
Mol. Mass.:119233.17
Organism:Homo sapiens (Human)
Description:Q05397
Residue:1052
BDBM50427225
NameBDBM50427225
Synonyms:CHEMBL2325101
TypeSmall organic molecule
Emp. Form.C25H18Cl2N2
Mol. Mass.417.33
SMILESClc1ccc(cc1Cl)C1=NN(C(C1)c1ccc2ccccc2c1)c1ccccc1