Reaction Details
TargetFocal adhesion kinase 1
LigandBDBM50427230
Substrate/Competitorn/a
Meas. Tech.ChEMBL_938525 (CHEMBL2327209)
IC50 13600±n/a nM
Citation Yang, WHu, YYang, YSZhang, FZhang, YBWang, XLTang, JFZhong, WQZhu, HL Design, modification and 3D QSAR studies of novel naphthalin-containing pyrazoline derivatives with/without thiourea skeleton as anticancer agents. Bioorg Med Chem21:1050-63 (2013) 
 
Focal adhesion kinase 1
Name:Focal adhesion kinase 1
Type:Tyrosine-protein kinase
Mol. Mass.:119233.17
Organism:Homo sapiens (Human)
Description:Q05397
Residue:1052
BDBM50427230
NameBDBM50427230
Synonyms:CHEMBL2325106
TypeSmall organic molecule
Emp. Form.C21H19N3OS
Mol. Mass.361.46
SMILESCOc1ccc(cc1)C1=NN(C(C1)c1cccc2ccccc12)C(N)=S