Reaction Details
TargetReceptor tyrosine-protein kinase erbB-2
LigandBDBM50322009
Substrate/Competitorn/a
Meas. Tech.ChEMBL_938530 (CHEMBL2327214)
IC50 2770±n/a nM
Citation Yang, WHu, YYang, YSZhang, FZhang, YBWang, XLTang, JFZhong, WQZhu, HL Design, modification and 3D QSAR studies of novel naphthalin-containing pyrazoline derivatives with/without thiourea skeleton as anticancer agents. Bioorg Med Chem21:1050-63 (2013) 
 
Receptor tyrosine-protein kinase erbB-2
Name:Receptor tyrosine-protein kinase erbB-2
Type:n/a
Mol. Mass.:137894.47
Organism:Homo sapiens (Human)
Description:P04626
Residue:1255
BDBM50322009
NameBDBM50322009
Synonyms:3-(3,4-Dimethylphenyl)-5-(4-methoxyphenyl)-4,5-dihydro-1H-pyrazole-1-carbothioamide | CHEMBL1173814
TypeSmall organic molecule
Emp. Form.C19H21N3OS
Mol. Mass.339.455
SMILESCOc1ccc(cc1)C1CC(=NN1C(N)=S)c1ccc(C)c(C)c1