Reaction Details
TargetEpidermal growth factor receptor
LigandBDBM50427225
Substrate/Competitorn/a
Meas. Tech.ChEMBL_938532 (CHEMBL2327216)
IC50 50±n/a nM
Citation Yang, WHu, YYang, YSZhang, FZhang, YBWang, XLTang, JFZhong, WQZhu, HL Design, modification and 3D QSAR studies of novel naphthalin-containing pyrazoline derivatives with/without thiourea skeleton as anticancer agents. Bioorg Med Chem21:1050-63 (2013) 
 
Epidermal growth factor receptor
Name:Epidermal growth factor receptor
Type:Receptor Kinase Domain
Mol. Mass.:134279.59
Organism:Homo sapiens (Human)
Description:P00533
Residue:1210
BDBM50427225
NameBDBM50427225
Synonyms:CHEMBL2325101
TypeSmall organic molecule
Emp. Form.C25H18Cl2N2
Mol. Mass.417.33
SMILESClc1ccc(cc1Cl)C1=NN(C(C1)c1ccc2ccccc2c1)c1ccccc1