Reaction Details
TargetEpidermal growth factor receptor
LigandBDBM50427231
Substrate/Competitorn/a
Meas. Tech.ChEMBL_938532 (CHEMBL2327216)
IC50 120±n/a nM
Citation Yang, WHu, YYang, YSZhang, FZhang, YBWang, XLTang, JFZhong, WQZhu, HL Design, modification and 3D QSAR studies of novel naphthalin-containing pyrazoline derivatives with/without thiourea skeleton as anticancer agents. Bioorg Med Chem21:1050-63 (2013) 
 
Epidermal growth factor receptor
Name:Epidermal growth factor receptor
Type:Receptor Kinase Domain
Mol. Mass.:134279.59
Organism:Homo sapiens (Human)
Description:P00533
Residue:1210
BDBM50427231
NameBDBM50427231
Synonyms:CHEMBL2325099
TypeSmall organic molecule
Emp. Form.C26H22N2O
Mol. Mass.378.4657
SMILESCOc1ccc(cc1)C1=NN(C(C1)c1ccc2ccccc2c1)c1ccccc1