Reaction Details
TargetEpidermal growth factor receptor
LigandBDBM50427241
Substrate/Competitorn/a
Meas. Tech.ChEMBL_938532 (CHEMBL2327216)
IC50 2520±n/a nM
Citation Yang, WHu, YYang, YSZhang, FZhang, YBWang, XLTang, JFZhong, WQZhu, HL Design, modification and 3D QSAR studies of novel naphthalin-containing pyrazoline derivatives with/without thiourea skeleton as anticancer agents. Bioorg Med Chem21:1050-63 (2013) 
 
Epidermal growth factor receptor
Name:Epidermal growth factor receptor
Type:Receptor Kinase Domain
Mol. Mass.:134279.59
Organism:Homo sapiens (Human)
Description:P00533
Residue:1210
BDBM50427241
NameBDBM50427241
Synonyms:CHEMBL2325088
TypeSmall organic molecule
Emp. Form.C25H20N2
Mol. Mass.348.4397
SMILESC1C(N(N=C1c1ccccc1)c1ccccc1)c1cccc2ccccc12