Reaction Details
TargetEpidermal growth factor receptor
LigandBDBM50427242
Substrate/Competitorn/a
Meas. Tech.ChEMBL_938532 (CHEMBL2327216)
IC50 1040±n/a nM
Citation Yang, WHu, YYang, YSZhang, FZhang, YBWang, XLTang, JFZhong, WQZhu, HL Design, modification and 3D QSAR studies of novel naphthalin-containing pyrazoline derivatives with/without thiourea skeleton as anticancer agents. Bioorg Med Chem21:1050-63 (2013) 
 
Epidermal growth factor receptor
Name:Epidermal growth factor receptor
Type:Receptor Kinase Domain
Mol. Mass.:134279.59
Organism:Homo sapiens (Human)
Description:P00533
Residue:1210
BDBM50427242
NameBDBM50427242
Synonyms:CHEMBL2324872
TypeSmall organic molecule
Emp. Form.C21H19N3OS
Mol. Mass.361.46
SMILESCOc1ccc(cc1)C1=NN(C(C1)c1ccc2ccccc2c1)C(N)=S