Reaction Details
TargetEpidermal growth factor receptor
LigandBDBM50427248
Substrate/Competitorn/a
Meas. Tech.ChEMBL_938532 (CHEMBL2327216)
IC50 2060±n/a nM
Citation Yang, WHu, YYang, YSZhang, FZhang, YBWang, XLTang, JFZhong, WQZhu, HL Design, modification and 3D QSAR studies of novel naphthalin-containing pyrazoline derivatives with/without thiourea skeleton as anticancer agents. Bioorg Med Chem21:1050-63 (2013) 
 
Epidermal growth factor receptor
Name:Epidermal growth factor receptor
Type:Receptor Kinase Domain
Mol. Mass.:134279.59
Organism:Homo sapiens (Human)
Description:P00533
Residue:1210
BDBM50427248
NameBDBM50427248
Synonyms:CHEMBL2325107
TypeSmall organic molecule
Emp. Form.C21H19N3S
Mol. Mass.345.461
SMILESCc1ccc(cc1)C1=NN(C(C1)c1cccc2ccccc12)C(N)=S