Reaction Details
TargetO-acetylserine sulfhydrylase
LigandBDBM50427257
Substrate/Competitorn/a
Meas. Tech.ChEMBL_938538 (CHEMBL2327377)
Ki 5000±n/a nM
Citation Jean Kumar, VUPoyraz, ÖSaxena, SSchnell, RYogeeswari, PSchneider, GSriram, D Discovery of novel inhibitors targeting the Mycobacterium tuberculosis O-acetylserine sulfhydrylase (CysK1) using virtual high-throughput screening. Bioorg Med Chem Lett23:1182-6 (2013) 
 
O-acetylserine sulfhydrylase
Name:O-acetylserine sulfhydrylase
Type:PROTEIN
Mol. Mass.:32747.29
Organism:Mycobacterium tuberculosis
Description:ChEMBL_978239
Residue:310
BDBM50427257
NameBDBM50427257
Synonyms:CHEMBL2325118
TypeSmall organic molecule
Emp. Form.C22H32N4O8
Mol. Mass.480.5115
SMILESCC[C@H](C)[C@H](NC(=O)[C@H](CO)NC(=O)[C@H](Cc1ccccc1)NC(=O)[C@@H](N)CC(O)=O)C(O)=O